Dataset
subclass of: Resource
history note: dcterms:Dataset es un término más amplio que void:Dataset, de forma que admite datasets que no son linked data
comment: Un conjunto de datos
type: Class
definition: A dataset @en
subclass of: Dataset
issued: 2009-09-28

Catálogo de datasets
subclass of: Resource
type: Class
comment: Catálogo donde se expresan conjuntos de datos
label: Catalog of Datasets @en
comment: Catalog which have defined datasets in @en
issued: 2009-09-28

Definición de la propiedad mejorada
value: Improved definition for the property @en
date: 2010-04-06
creator: CTIC-CT

dcterms:Dataset es un término más amplio que void:Dataset, de forma que admite datasets que no son linked data
value: dcterms:Dataset term is broader than void:Dataset, allowing non-linked data datasets @en
date: 2010-03-01
creator: CTIC-CT

Un Catálogo tiene un Dataset como miembro del mismo
domain: Catálogo de datasets
type: Property
range: Dataset
definition: Property which defines a Dataset member of the Catalog @en
definition: Propiedad que define que el Catálogo tiene un Dataset como miembro del mismo
issued: 2010-04-06
label: A Catalog has a Dataset member @en
range: Resource
domain: Resource

Un Dataset es miembro de un Catálogo
domain: Dataset
comment: Property which defines a Catalog that contains the Dataset @en
range: Catálogo de datasets
change note: Definición de la propiedad mejorada
label: A Dataset is a member of a Catalog @en
comment: Propiedad que define un Catálogo al que pertenece el Dataset
type: Property
issued: 2009-09-28
range: Resource
domain: Resource

Estado del catálogo
issued: 2010-09-01
definition: Propiedad que define el estado del catálogo en función de una taxonomía determinada
range: Dataset
definition: Property which defines the status of the Dataset according to a defined taxonomy @en
type: Property
label: Catalog status @en
range: Resource

application/rdf+xml
type: IMT
label: RDF

text/html
type: IMT
label: HTML

Datos disponibles en la Web
type: Concept
in scheme: Taxonomía de los estados de un catálogo
preferred label: Data available on the Web @en

Datos en formato no propietario disponibles en la Web
type: Concept
in scheme: Taxonomía de los estados de un catálogo
preferred label: Data in a non-proprietary format available on the Web @en

Datos estructurados disponibles en la Web
type: Concept
in scheme: Taxonomía de los estados de un catálogo
preferred label: Structured data available on the Web @en

Vocabulario de Catálogos de Datasets
type: Ontology
issued: 2009-09-28
comment: This vocabulary is used for modelling catalogs of datasets and its relationships with the datasets @en
comment: Este vocabulario se utiliza para modelar los catálogos de conjuntos de datos y las relaciones con los datasets
has format: dcat 20100901.html
preferred namespace prefix: ds
date: 2010-04-06
creator: CTIC CT
title: Dataset Catalog Vocabulary @en
rights: CTIC CT - Creative Commons 3.0 (BY-NC-SA)
license: http://creativecommons.org/licenses/by-nc-sa/3.0
has format: dcat 20100901.rdf

Datos en formato Linked Data disponibles en la Web
type: Concept
in scheme: Taxonomía de los estados de un catálogo
preferred label: Data in Linked Data format available on the Web @en

Taxonomía de los estados de un catálogo
type: ConceptScheme
comment: Esquema de conceptos de los estados que puede tomar un catálogo
label: Taxonomy of the catalog statuses @en
comment: Concept scheme of the different statuses for a catalog @en

Datos enlazados con otros datos en la Web
type: Concept
in scheme: Taxonomía de los estados de un catálogo
preferred label: Data linked with other data on the Web @en

Catálogo anunciado
type: Concept
in scheme: Taxonomía de los estados de un catálogo
preferred label: Catalog announced @en