Dataset
subclass of: Resource
history note: dcterms:Dataset term is broader than void:Dataset, allowing non-linked data datasets
comment: Un conjunto de datos @es
type: Class
definition: A dataset
subclass of: Dataset
issued: 2009-09-28

Catalog of Datasets
subclass of: Resource
type: Class
label: Catálogo de datasets @es
comment: Catálogo donde se expresan conjuntos de datos @es
comment: Catalog which have defined datasets in
issued: 2009-09-28

Improved definition for the property
value: Definición de la propiedad mejorada @es
date: 2010-04-06
creator: CTIC-CT

dcterms:Dataset term is broader than void:Dataset, allowing non-linked data datasets
value: dcterms:Dataset es un término más amplio que void:Dataset, de forma que admite datasets que no son linked data @es
date: 2010-03-01
creator: CTIC-CT

A Catalog has a Dataset member
domain: Catalog of Datasets
type: Property
label: Un Catálogo tiene un Dataset como miembro del mismo @es
range: Dataset
definition: Property which defines a Dataset member of the Catalog
definition: Propiedad que define que el Catálogo tiene un Dataset como miembro del mismo @es
issued: 2010-04-06
domain: Resource
range: Resource

A Dataset is a member of a Catalog
domain: Dataset
comment: Property which defines a Catalog that contains the Dataset
label: Un Dataset es miembro de un Catálogo @es
range: Catalog of Datasets
change note: Improved definition for the property
comment: Propiedad que define un Catálogo al que pertenece el Dataset @es
type: Property
issued: 2009-09-28
domain: Resource
range: Resource

Catalog status
issued: 2010-09-01
definition: Propiedad que define el estado del catálogo en función de una taxonomía determinada @es
range: Dataset
definition: Property which defines the status of the Dataset according to a defined taxonomy
type: Property
label: Estado del catálogo @es
range: Resource

application/rdf+xml
type: IMT
label: RDF

Toronto Open Catalog
issued: 2009-12-01
title: http://lodlaundromat.org/.well-known/genid/06a71d8045dd22a50cf699d57441da4f#3
type: Catalog
spatial: http://lodlaundromat.org/.well-known/genid/06a71d8045dd22a50cf699d57441da4f#4
status: status-nonProprietaryFormat
language: en
label: http://lodlaundromat.org/.well-known/genid/06a71d8045dd22a50cf699d57441da4f#1
type: official
description: http://lodlaundromat.org/.well-known/genid/06a71d8045dd22a50cf699d57441da4f#2
description: Toronto.ca/Open... building a city that thinks like the web"

text/html
type: IMT
label: HTML

Data available on the Web
type: Concept
in scheme: Taxonomy of the catalog statuses
preferred label: Datos disponibles en la Web @es

Data in a non-proprietary format available on the Web
type: Concept
in scheme: Taxonomy of the catalog statuses
preferred label: Datos en formato no propietario disponibles en la Web @es

Structured data available on the Web
type: Concept
in scheme: Taxonomy of the catalog statuses
preferred label: Datos estructurados disponibles en la Web @es

Dataset Catalog Vocabulary
type: Ontology
issued: 2009-09-28
comment: This vocabulary is used for modelling catalogs of datasets and its relationships with the datasets
title: Vocabulario de Catálogos de Datasets @es
comment: Este vocabulario se utiliza para modelar los catálogos de conjuntos de datos y las relaciones con los datasets @es
has format: dcat 20100901.html
preferred namespace prefix: ds
date: 2010-04-06
creator: CTIC CT
rights: CTIC CT - Creative Commons 3.0 (BY-NC-SA) @es
license: http://creativecommons.org/licenses/by-nc-sa/3.0
has format: dcat 20100901.rdf

Data in Linked Data format available on the Web
type: Concept
in scheme: Taxonomy of the catalog statuses
preferred label: Datos en formato Linked Data disponibles en la Web @es

Taxonomy of the catalog statuses
type: ConceptScheme
label: Taxonomía de los estados de un catálogo @es
comment: Esquema de conceptos de los estados que puede tomar un catálogo @es
comment: Concept scheme of the different statuses for a catalog

Data linked with other data on the Web
type: Concept
in scheme: Taxonomy of the catalog statuses
preferred label: Datos enlazados con otros datos en la Web @es

Catalog announced
type: Concept
in scheme: Taxonomy of the catalog statuses
preferred label: Catálogo anunciado @es