JOANNEUM RESEARCH
member: Wolfgang Halb
type: Agent
type: Thing

Identifier
property disjoint with: bottomObjectProperty
type: Thing
description: Recommended best practice is to identify the resource by means of a string conforming to a formal identification system.
note: A second property with the same name as this property has been declared in the dcterms: namespace (http://purl.org/dc/terms/). See the Introduction to the document "DCMI Metadata Terms" (http://dublincore.org/documents/dcmi-terms/) for an explanation.
modified: 2008-01-14
sub property of: topObjectProperty
issued: 1999-07-02
has version: identifier-006
type: ObjectProperty
type: Property
comment: An unambiguous reference to the resource within a given context.

Unit System
disjoint with: Unit
disjoint with: Area Unit
disjoint with: Nothing
disjoint with: Quantity
subclass of: Class
subclass of: Thing
type: Class
description: A unit system is a class of units for which no two elements in the class measure the same dimension (i.e. all dimensions are orthogonal to each other, or measure dimensions derived from a set of orthogonal dimensions with units derived from the units that measure those orthogonal dimensions specified in the system.
subclass of: Unit Class

Lee Feigenbaum
type: Thing
type: Person

Type
type: Thing
sub property of: topObjectProperty
note: A second property with the same name as this property has been declared in the dcterms: namespace (http://purl.org/dc/terms/). See the Introduction to the document "DCMI Metadata Terms" (http://dublincore.org/documents/dcmi-terms/) for an explanation.
property disjoint with: bottomObjectProperty
type: ObjectProperty
issued: 1999-07-02
has version: type-006
description: Recommended best practice is to use a controlled vocabulary such as the DCMI Type Vocabulary [DCMITYPE]. To describe the file format, physical medium, or dimensions of the resource, use the Format element.
modified: 2008-01-14
type: Property
comment: The nature or genre of the resource.

Subject
property disjoint with: bottomObjectProperty
modified: 2012-06-14
sub property of: topObjectProperty
type: ObjectProperty
note: A second property with the same name as this property has been declared in the dcterms: namespace (http://purl.org/dc/terms/). See the Introduction to the document "DCMI Metadata Terms" (http://dublincore.org/documents/dcmi-terms/) for an explanation.
type: Thing
description: Typically, the subject will be represented using keywords, key phrases, or classification codes. Recommended best practice is to use a controlled vocabulary.
has version: subject-007
issued: 1999-07-02
type: Property
comment: The topic of the resource.

belongs to dataset
sub property of: topObjectProperty
property disjoint with: bottomObjectProperty
type: ObjectProperty
type: Property
domain: Item
range: Dataset

Language
issued: 1999-07-02
type: Thing
type: ObjectProperty
note: A second property with the same name as this property has been declared in the dcterms: namespace (http://purl.org/dc/terms/). See the Introduction to the document "DCMI Metadata Terms" (http://dublincore.org/documents/dcmi-terms/) for an explanation.
has version: language-007
description: Recommended best practice is to use a controlled vocabulary such as RFC 4646 [RFC4646].
sub property of: topObjectProperty
property disjoint with: bottomObjectProperty
modified: 2008-01-14
type: Property
comment: A language of the resource.

equivalent quantity
property disjoint with: unitClass
property disjoint with: equivalent unit class
property disjoint with: bottomObjectProperty
property disjoint with: unit
property disjoint with: area
type: ObjectProperty
inverse of: unitClass
type: InverseFunctionalProperty
sub property of: topObjectProperty
description: An equivalent quantity of a unit class is the quantity measured by all units in the unit class.
domain: Unit Class
range: Quantity

Format
type: Thing
description: Examples of dimensions include size and duration. Recommended best practice is to use a controlled vocabulary such as the list of Internet Media Types [MIME].
sub property of: topObjectProperty
property disjoint with: bottomObjectProperty
modified: 2008-01-14
issued: 1999-07-02
note: A second property with the same name as this property has been declared in the dcterms: namespace (http://purl.org/dc/terms/). See the Introduction to the document "DCMI Metadata Terms" (http://dublincore.org/documents/dcmi-terms/) for an explanation.
has version: format-007
type: ObjectProperty
type: Property
comment: The file format, physical medium, or dimensions of the resource.

Danny Ayers
type: Thing
type: Person

has a maximum range value
sub property of: topObjectProperty
property disjoint with: bottomObjectProperty
type: ObjectProperty
type: Property
domain: Dimension

Dublin Core Metadata Element Set, Version 1.1
modified: 2012-06-14
publisher: DCMI
type: Thing

Description
description: Description may include but is not limited to: an abstract, a table of contents, a graphical representation, or a free-text account of the resource.
note: A second property with the same name as this property has been declared in the dcterms: namespace (http://purl.org/dc/terms/). See the Introduction to the document "DCMI Metadata Terms" (http://dublincore.org/documents/dcmi-terms/) for an explanation.
issued: 1999-07-02
modified: 2008-01-14
has version: description-006
type: Thing
type: AnnotationProperty
comment: An account of the resource.
type: Property

Dataset
disjoint with: Nothing
subclass of: Thing
type: Class
comment: a statistical dataset

Publisher
modified: 2008-01-14
issued: 1999-07-02
description: Examples of a Publisher include a person, an organization, or a service. Typically, the name of a Publisher should be used to indicate the entity.
type: Thing
type: ObjectProperty
has version: publisher-006
note: A second property with the same name as this property has been declared in the dcterms: namespace (http://purl.org/dc/terms/). See the Introduction to the document "DCMI Metadata Terms" (http://dublincore.org/documents/dcmi-terms/) for an explanation.
sub property of: topObjectProperty
property disjoint with: bottomObjectProperty
type: Property
comment: An entity responsible for making the resource available.

Source
property disjoint with: bottomObjectProperty
issued: 1999-07-02
type: Thing
description: The described resource may be derived from the related resource in whole or in part. Recommended best practice is to identify the related resource by means of a string conforming to a formal identification system.
sub property of: topObjectProperty
modified: 2008-01-14
note: A second property with the same name as this property has been declared in the dcterms: namespace (http://purl.org/dc/terms/). See the Introduction to the document "DCMI Metadata Terms" (http://dublincore.org/documents/dcmi-terms/) for an explanation.
has version: source-006
type: ObjectProperty
type: Property
comment: A related resource from which the described resource is derived.

Creator
description: Examples of a Creator include a person, an organization, or a service. Typically, the name of a Creator should be used to indicate the entity.
note: A second property with the same name as this property has been declared in the dcterms: namespace (http://purl.org/dc/terms/). See the Introduction to the document "DCMI Metadata Terms" (http://dublincore.org/documents/dcmi-terms/) for an explanation.
issued: 1999-07-02
modified: 2008-01-14
has version: creator-006
type: Thing
comment: An entity primarily responsible for making the resource.
type: Property
type: AnnotationProperty

has a dimension
sub property of: topObjectProperty
property disjoint with: bottomObjectProperty
type: ObjectProperty
type: Property
domain: Item
range: Dimension

Yves Raimond
type: Thing
type: Person

has a minimum range value
sub property of: topObjectProperty
property disjoint with: bottomObjectProperty
type: ObjectProperty
type: Property
domain: Dimension

The Statistical Core Vocabulary (SCOVO)
modified: 2012-08-09
type: Thing
created: 2010-01-26
type: Ontology
part of: vocab.deri.ie
preferred namespace uri: http://purl.org/NET/scovo#
description: A vocabulary for representing statistical data on the Web. Note: The SCOVO vocabulary is deprecated. We strongly advise to use the Data Cube Vocabulary instead.
preferred namespace prefix: scovo
status: UnderDevelopment
type: SemanticAsset
creator: Yves Raimond
publisher: LiDRC
creator: Tom Heath
creator: Michael Hausenblas
creator: Lee Feigenbaum
creator: Wolfgang Halb
creator: Danny Ayers

is the dataset of
sub property of: topObjectProperty
property disjoint with: bottomObjectProperty
type: ObjectProperty
type: Property
domain: Dataset
range: Item

area
sub property of: topObjectProperty
property disjoint with: measured quantity
property disjoint with: equivalent quantity
property disjoint with: unit
property disjoint with: bottomObjectProperty
type: ObjectProperty
range: Area Measurement

Tom Heath
type: Thing
type: Person

Michael Hausenblas
type: Thing
type: Person

Area Unit
type: Item
type: Thing
equivalent quantity: Area
subclass of: Unit
subclass of: Dimension
disjoint with: Unit System
different from: http://lodlaundromat.org/.well-known/genid/02aa9cd4f94535abed9ec1842b84ba38#4
has a dimension: Area
different from: square kilometers
disjoint with: Area Measurement
disjoint with: Quantity
disjoint with: Nothing
different from: Area
subclass of: Thing
type: Class
measured quantity: Area
type: Measurement
disjoint with: Measurement
type: Unit Class

Area Measurement
disjoint with: Quantity
subclass of: Item
disjoint with: Unit
subclass of: Measurement
disjoint with: Area Unit
disjoint with: Nothing
subclass of: Class
type: Class
subclass of: Thing
subclass of: http://lodlaundromat.org/.well-known/genid/02aa9cd4f94535abed9ec1842b84ba38#2
subclass of: http://lodlaundromat.org/.well-known/genid/02aa9cd4f94535abed9ec1842b84ba38#3

Relation
property disjoint with: bottomObjectProperty
issued: 1999-07-02
type: Thing
type: ObjectProperty
modified: 2008-01-14
sub property of: topObjectProperty
has version: relation-006
note: A second property with the same name as this property has been declared in the dcterms: namespace (http://purl.org/dc/terms/). See the Introduction to the document "DCMI Metadata Terms" (http://dublincore.org/documents/dcmi-terms/) for an explanation.
description: Recommended best practice is to identify the related resource by means of a string conforming to a formal identification system.
type: Property
comment: A related resource.

equivalent unit class
type: FunctionalProperty
property disjoint with: unit
property disjoint with: bottomObjectProperty
sub property of: topObjectProperty
type: ObjectProperty
inverse of: measured quantity
property disjoint with: measured quantity
property disjoint with: equivalent quantity
description: An equivalent unit class of a quantity is the unit class corresponding to units that measure the quantity.
domain: Quantity
range: Unit Class

Date
has version: date-006
modified: 2008-01-14
description: Date may be used to express temporal information at any level of granularity. Recommended best practice is to use an encoding scheme, such as the W3CDTF profile of ISO 8601 [W3CDTF].
sub property of: topObjectProperty
type: ObjectProperty
note: A second property with the same name as this property has been declared in the dcterms: namespace (http://purl.org/dc/terms/). See the Introduction to the document "DCMI Metadata Terms" (http://dublincore.org/documents/dcmi-terms/) for an explanation.
property disjoint with: bottomObjectProperty
type: Thing
issued: 1999-07-02
type: Property
comment: A point or period of time associated with an event in the lifecycle of the resource.

Quantity
disjoint with: Nothing
disjoint with: Unit System
disjoint with: Measurement
subclass of: Dimension
disjoint with: Area Unit
disjoint with: Area Measurement
subclass of: Thing
type: Class
disjoint with: Unit
description: A quantity is a quantifiable quality of an object.
disjoint with: Unit Class

Area
unit class: Area Unit
equivalent unit class: Area Unit
different from: Area Unit
different from: square kilometers
different from: http://lodlaundromat.org/.well-known/genid/02aa9cd4f94535abed9ec1842b84ba38#4
type: Dimension
type: Thing
type: Quantity

unit
sub property of: has a dimension
sub property of: topObjectProperty
property disjoint with: equivalent quantity
property disjoint with: bottomObjectProperty
property disjoint with: equivalent unit class
property disjoint with: unitClass
type: ObjectProperty
type: FunctionalProperty
property disjoint with: measured quantity
property disjoint with: area
description: The unit a measurement is made in.
domain: Measurement
range: Unit

measured quantity
type: ObjectProperty
property disjoint with: bottomObjectProperty
inverse of: equivalent unit class
property disjoint with: unitClass
sub property of: has a dimension
property disjoint with: equivalent unit class
sub property of: topObjectProperty
property disjoint with: area
property disjoint with: unit
type: FunctionalProperty
description: The quantity measured for a measurement.
domain: Measurement
range: Quantity

Unit
subclass of: Thing
disjoint with: Unit System
disjoint with: Nothing
disjoint with: Quantity
subclass of: Dimension
disjoint with: Measurement
type: Thing
type: Class
disjoint with: Area Measurement
description: A unit is a particular quantity against which another quantity may be compared. Hence, a unit is dimensionful and provides a ratio by which a quantity may be measured.
disjoint with: Unit Class

LiDRC
member: Michael Hausenblas
type: Agent
type: Thing

Wolfgang Halb
type: Thing
type: Person

square kilometers
different from: Area Unit
different from: Area
type: Unit
type: Area Unit
type: Dimension
type: Thing

Dimension
disjoint with: Nothing
subclass of: Thing
type: Class
comment: a dimension of a statistical data item

Contributor
issued: 1999-07-02
type: Thing
type: ObjectProperty
property disjoint with: bottomObjectProperty
modified: 2008-01-14
description: Examples of a Contributor include a person, an organization, or a service. Typically, the name of a Contributor should be used to indicate the entity.
sub property of: topObjectProperty
note: A second property with the same name as this property has been declared in the dcterms: namespace (http://purl.org/dc/terms/). See the Introduction to the document "DCMI Metadata Terms" (http://dublincore.org/documents/dcmi-terms/) for an explanation.
has version: contributor-006
type: Property
comment: An entity responsible for making contributions to the resource.

Coverage
description: Spatial topic and spatial applicability may be a named place or a location specified by its geographic coordinates. Temporal topic may be a named period, date, or date range. A jurisdiction may be a named administrative entity or a geographic place to which the resource applies. Recommended best practice is to use a controlled vocabulary such as the Thesaurus of Geographic Names [TGN]. Where appropriate, named places or time periods can be used in preference to numeric identifiers such as sets of coordinates or date ranges.
type: Thing
property disjoint with: bottomObjectProperty
type: ObjectProperty
modified: 2008-01-14
has version: coverage-006
issued: 1999-07-02
note: A second property with the same name as this property has been declared in the dcterms: namespace (http://purl.org/dc/terms/). See the Introduction to the document "DCMI Metadata Terms" (http://dublincore.org/documents/dcmi-terms/) for an explanation.
sub property of: topObjectProperty
type: Property
comment: The spatial or temporal topic of the resource, the spatial applicability of the resource, or the jurisdiction under which the resource is relevant.

Item
disjoint with: Nothing
subclass of: Thing
type: Class
comment: a statistical data item

Rights
type: Thing
property disjoint with: bottomObjectProperty
has version: rights-006
description: Typically, rights information includes a statement about various property rights associated with the resource, including intellectual property rights.
issued: 1999-07-02
sub property of: topObjectProperty
note: A second property with the same name as this property has been declared in the dcterms: namespace (http://purl.org/dc/terms/). See the Introduction to the document "DCMI Metadata Terms" (http://dublincore.org/documents/dcmi-terms/) for an explanation.
type: ObjectProperty
modified: 2008-01-14
type: Property
comment: Information about rights held in and over the resource.

Measurement
disjoint with: Unit
subclass of: Item
type: Class
disjoint with: Quantity
disjoint with: Area Unit
subclass of: Thing
disjoint with: Nothing
subclass of: Class
description: A measurement is a statistic that measures a quantity that may or may not have units.
subclass of: http://lodlaundromat.org/.well-known/genid/02aa9cd4f94535abed9ec1842b84ba38#1

Title
note: A second property with the same name as this property has been declared in the dcterms: namespace (http://purl.org/dc/terms/). See the Introduction to the document "DCMI Metadata Terms" (http://dublincore.org/documents/dcmi-terms/) for an explanation.
issued: 1999-07-02
modified: 2008-01-14
has version: title-006
type: Thing
type: Property
comment: A name given to the resource.
type: AnnotationProperty

Measurement Ontology
creator: me
description: The Measurement Ontology is an ontology in which measurements may be rendered.
type: Ontology

http://lodlaundromat.org/.well-known/genid/02aa9cd4f94535abed9ec1842b84ba38#1
type: Restriction
cardinality: 1
on property: measured quantity

Unit Class
type: Class
type: Restriction
description: A unit class is a subset of units, with no particular restriction on its contents (i.e. it may be a set of units measuring orthogonal quantities, making a UnitSystem, or a set of units measuring the same quantity).
subclass of: Class
disjoint with: Quantity
disjoint with: Unit
has value: Unit
on property: subClassOf

http://lodlaundromat.org/.well-known/genid/02aa9cd4f94535abed9ec1842b84ba38#5
type: Restriction
max cardinality: 1
on property: units