Unit System
subclass of: Resource
subclass of: Thing
type: Class
description: A unit system is a class of units for which no two elements in the class measure the same dimension (i.e. all dimensions are orthogonal to each other, or measure dimensions derived from a set of orthogonal dimensions with units derived from the units that measure those orthogonal dimensions specified in the system.
subclass of: Unit Class
subclass of: Class

equivalent quantity
range: Thing
domain: Thing
type: Property
type: InverseFunctionalProperty
type: ObjectProperty
description: An equivalent quantity of a unit class is the quantity measured by all units in the unit class.
domain: Unit Class
range: Quantity
inverse of: unitClass
domain: Resource
domain: Class
range: Resource
range: Dimension

Dataset
subclass of: Resource
subclass of: Thing
type: Class
comment: a statistical dataset

area
range: Thing
domain: Thing
type: ObjectProperty
range: Area Measurement
type: Property
domain: Resource
range: Resource
range: http://lodlaundromat.org/.well-known/genid/02aa9cd4f94535abed9ec1842b84ba38#3
range: http://lodlaundromat.org/.well-known/genid/02aa9cd4f94535abed9ec1842b84ba38#2
range: http://lodlaundromat.org/.well-known/genid/02aa9cd4f94535abed9ec1842b84ba38#1
range: Item
range: Measurement

http://lodlaundromat.org/.well-known/genid/02aa9cd4f94535abed9ec1842b84ba38#1
type: Class
subclass of: Resource
subclass of: Thing
type: Restriction
cardinality: 1
on property: measured quantity

Unit Class
subclass of: Thing
subclass of: Resource
type: Class
type: Restriction
description: A unit class is a subset of units, with no particular restriction on its contents (i.e. it may be a set of units measuring orthogonal quantities, making a UnitSystem, or a set of units measuring the same quantity).
subclass of: Class
disjoint with: Quantity
disjoint with: Unit
has value: Unit
on property: subClassOf

Area Measurement
subclass of: Resource
type: Class
subclass of: Thing
subclass of: http://lodlaundromat.org/.well-known/genid/02aa9cd4f94535abed9ec1842b84ba38#2
subclass of: http://lodlaundromat.org/.well-known/genid/02aa9cd4f94535abed9ec1842b84ba38#3
subclass of: Measurement
subclass of: http://lodlaundromat.org/.well-known/genid/02aa9cd4f94535abed9ec1842b84ba38#1
subclass of: Item

equivalent unit class
range: Measurement
range: Thing
type: InverseFunctionalProperty
domain: Thing
type: Property
type: FunctionalProperty
type: ObjectProperty
description: An equivalent unit class of a quantity is the unit class corresponding to units that measure the quantity.
domain: Quantity
range: Unit Class
inverse of: measured quantity
domain: Resource
domain: Dimension
range: Resource
range: Class
range: http://lodlaundromat.org/.well-known/genid/02aa9cd4f94535abed9ec1842b84ba38#1
range: Item

Quantity
subclass of: Thing
subclass of: Resource
type: Class
description: A quantity is a quantifiable quality of an object.
subclass of: Dimension
disjoint with: Unit
disjoint with: Unit Class

unit
range: Thing
domain: Thing
type: FunctionalProperty
type: ObjectProperty
description: The unit a measurement is made in.
domain: Measurement
range: Unit
sub property of: has a dimension
type: Property
range: Dimension
range: Resource
domain: Item
domain: Resource
domain: http://lodlaundromat.org/.well-known/genid/02aa9cd4f94535abed9ec1842b84ba38#1

measured quantity
type: InverseFunctionalProperty
domain: Unit Class
inverse of: equivalent unit class
range: Thing
domain: Thing
type: FunctionalProperty
type: ObjectProperty
description: The quantity measured for a measurement.
domain: Measurement
range: Quantity
sub property of: has a dimension
type: Property
range: Dimension
range: Resource
domain: Item
domain: Resource
domain: Class
domain: http://lodlaundromat.org/.well-known/genid/02aa9cd4f94535abed9ec1842b84ba38#1

Unit
subclass of: Resource
subclass of: Thing
type: Class
description: A unit is a particular quantity against which another quantity may be compared. Hence, a unit is dimensionful and provides a ratio by which a quantity may be measured.
subclass of: Dimension
disjoint with: Quantity
disjoint with: Unit Class
type: Unit Class
type: Thing
different from: Area
different from: http://lodlaundromat.org/.well-known/genid/02aa9cd4f94535abed9ec1842b84ba38#4
different from: square kilometers

http://lodlaundromat.org/.well-known/genid/02aa9cd4f94535abed9ec1842b84ba38#5
subclass of: Resource
subclass of: Thing
type: Class
type: Restriction
max cardinality: 1
on property: units

Dimension
subclass of: Resource
subclass of: Thing
type: Class
comment: a dimension of a statistical data item

Item
subclass of: Resource
subclass of: Thing
type: Class
comment: a statistical data item

Measurement
type: Class
subclass of: Resource
subclass of: Thing
description: A measurement is a statistic that measures a quantity that may or may not have units.
subclass of: http://lodlaundromat.org/.well-known/genid/02aa9cd4f94535abed9ec1842b84ba38#1
subclass of: Item

JOANNEUM RESEARCH
type: Agent
member: Wolfgang Halb

Identifier
description: Recommended best practice is to identify the resource by means of a string conforming to a formal identification system.
has version: identifier-006
issued: 1999-07-02
modified: 2008-01-14
type: Property
comment: An unambiguous reference to the resource within a given context.
note: A second property with the same name as this property has been declared in the dcterms: namespace (http://purl.org/dc/terms/). See the Introduction to the document "DCMI Metadata Terms" (http://dublincore.org/documents/dcmi-terms/) for an explanation.

Lee Feigenbaum
type: Person

Type
description: Recommended best practice is to use a controlled vocabulary such as the DCMI Type Vocabulary [DCMITYPE]. To describe the file format, physical medium, or dimensions of the resource, use the Format element.
has version: type-006
issued: 1999-07-02
modified: 2008-01-14
type: Property
comment: The nature or genre of the resource.
note: A second property with the same name as this property has been declared in the dcterms: namespace (http://purl.org/dc/terms/). See the Introduction to the document "DCMI Metadata Terms" (http://dublincore.org/documents/dcmi-terms/) for an explanation.

Subject
description: Typically, the subject will be represented using keywords, key phrases, or classification codes. Recommended best practice is to use a controlled vocabulary.
has version: subject-007
issued: 1999-07-02
modified: 2012-06-14
type: Property
comment: The topic of the resource.
note: A second property with the same name as this property has been declared in the dcterms: namespace (http://purl.org/dc/terms/). See the Introduction to the document "DCMI Metadata Terms" (http://dublincore.org/documents/dcmi-terms/) for an explanation.

belongs to dataset
type: Property
domain: Item
range: Dataset
domain: Thing
domain: Resource
range: Thing
range: Resource

Language
issued: 1999-07-02
note: A second property with the same name as this property has been declared in the dcterms: namespace (http://purl.org/dc/terms/). See the Introduction to the document "DCMI Metadata Terms" (http://dublincore.org/documents/dcmi-terms/) for an explanation.
has version: language-007
description: Recommended best practice is to use a controlled vocabulary such as RFC 4646 [RFC4646].
type: Property
comment: A language of the resource.
modified: 2008-01-14

Format
description: Examples of dimensions include size and duration. Recommended best practice is to use a controlled vocabulary such as the list of Internet Media Types [MIME].
has version: format-007
issued: 1999-07-02
modified: 2008-01-14
type: Property
comment: The file format, physical medium, or dimensions of the resource.
note: A second property with the same name as this property has been declared in the dcterms: namespace (http://purl.org/dc/terms/). See the Introduction to the document "DCMI Metadata Terms" (http://dublincore.org/documents/dcmi-terms/) for an explanation.

Danny Ayers
type: Person

has a maximum range value
type: Property
domain: Dimension
domain: Thing
domain: Resource

Dublin Core Metadata Element Set, Version 1.1
modified: 2012-06-14
publisher: DCMI

Description
modified: 2008-01-14
type: AnnotationProperty
has version: description-006
note: A second property with the same name as this property has been declared in the dcterms: namespace (http://purl.org/dc/terms/). See the Introduction to the document "DCMI Metadata Terms" (http://dublincore.org/documents/dcmi-terms/) for an explanation.
comment: An account of the resource.
type: Property
issued: 1999-07-02
description: Description may include but is not limited to: an abstract, a table of contents, a graphical representation, or a free-text account of the resource.

Publisher
description: Examples of a Publisher include a person, an organization, or a service. Typically, the name of a Publisher should be used to indicate the entity.
has version: publisher-006
issued: 1999-07-02
modified: 2008-01-14
type: Property
comment: An entity responsible for making the resource available.
note: A second property with the same name as this property has been declared in the dcterms: namespace (http://purl.org/dc/terms/). See the Introduction to the document "DCMI Metadata Terms" (http://dublincore.org/documents/dcmi-terms/) for an explanation.

Source
description: The described resource may be derived from the related resource in whole or in part. Recommended best practice is to identify the related resource by means of a string conforming to a formal identification system.
has version: source-006
issued: 1999-07-02
modified: 2008-01-14
type: Property
comment: A related resource from which the described resource is derived.
note: A second property with the same name as this property has been declared in the dcterms: namespace (http://purl.org/dc/terms/). See the Introduction to the document "DCMI Metadata Terms" (http://dublincore.org/documents/dcmi-terms/) for an explanation.

Creator
comment: An entity primarily responsible for making the resource.
has version: creator-006
description: Examples of a Creator include a person, an organization, or a service. Typically, the name of a Creator should be used to indicate the entity.
issued: 1999-07-02
note: A second property with the same name as this property has been declared in the dcterms: namespace (http://purl.org/dc/terms/). See the Introduction to the document "DCMI Metadata Terms" (http://dublincore.org/documents/dcmi-terms/) for an explanation.
type: Property
modified: 2008-01-14
type: AnnotationProperty

Measurement Ontology
creator: me
description: The Measurement Ontology is an ontology in which measurements may be rendered.
type: Ontology

has a dimension
type: Property
domain: Item
range: Dimension
domain: Thing
domain: Resource
range: Thing
range: Resource

Yves Raimond
type: Person

has a minimum range value
type: Property
domain: Dimension
domain: Thing
domain: Resource

The Statistical Core Vocabulary (SCOVO)
creator: Yves Raimond
publisher: LiDRC
creator: Tom Heath
creator: Michael Hausenblas
modified: 2012-08-09
type: Ontology
created: 2010-01-26
part of: vocab.deri.ie
preferred namespace uri: http://purl.org/NET/scovo#
creator: Lee Feigenbaum
creator: Wolfgang Halb
description: A vocabulary for representing statistical data on the Web. Note: The SCOVO vocabulary is deprecated. We strongly advise to use the Data Cube Vocabulary instead.
preferred namespace prefix: scovo
creator: Danny Ayers
status: UnderDevelopment
type: SemanticAsset

is the dataset of
type: Property
domain: Dataset
range: Item
domain: Thing
domain: Resource
range: Thing
range: Resource

Tom Heath
type: Person

Michael Hausenblas
type: Person

Area Unit
equivalent quantity: Area
type: Unit Class
subclass of: Unit
type: Thing
type: Class
measured quantity: Area
type: Measurement
type: Item
has a dimension: Area
type: http://lodlaundromat.org/.well-known/genid/02aa9cd4f94535abed9ec1842b84ba38#1
different from: Area
different from: http://lodlaundromat.org/.well-known/genid/02aa9cd4f94535abed9ec1842b84ba38#4
different from: square kilometers

Relation
description: Recommended best practice is to identify the related resource by means of a string conforming to a formal identification system.
has version: relation-006
issued: 1999-07-02
modified: 2008-01-14
type: Property
comment: A related resource.
note: A second property with the same name as this property has been declared in the dcterms: namespace (http://purl.org/dc/terms/). See the Introduction to the document "DCMI Metadata Terms" (http://dublincore.org/documents/dcmi-terms/) for an explanation.

Date
description: Date may be used to express temporal information at any level of granularity. Recommended best practice is to use an encoding scheme, such as the W3CDTF profile of ISO 8601 [W3CDTF].
has version: date-006
issued: 1999-07-02
modified: 2008-01-14
type: Property
comment: A point or period of time associated with an event in the lifecycle of the resource.
note: A second property with the same name as this property has been declared in the dcterms: namespace (http://purl.org/dc/terms/). See the Introduction to the document "DCMI Metadata Terms" (http://dublincore.org/documents/dcmi-terms/) for an explanation.

Area
equivalent unit class: Area Unit
type: Quantity
type: Thing
unit class: Area Unit
type: Dimension
different from: Area Unit
different from: Unit
different from: http://lodlaundromat.org/.well-known/genid/02aa9cd4f94535abed9ec1842b84ba38#4
different from: square kilometers

LiDRC
type: Agent
member: Michael Hausenblas

Wolfgang Halb
type: Person

square kilometers
type: Area Unit
type: Unit
type: Dimension
type: Thing
different from: Area
different from: Area Unit
different from: Unit

Contributor
description: Examples of a Contributor include a person, an organization, or a service. Typically, the name of a Contributor should be used to indicate the entity.
has version: contributor-006
issued: 1999-07-02
modified: 2008-01-14
type: Property
comment: An entity responsible for making contributions to the resource.
note: A second property with the same name as this property has been declared in the dcterms: namespace (http://purl.org/dc/terms/). See the Introduction to the document "DCMI Metadata Terms" (http://dublincore.org/documents/dcmi-terms/) for an explanation.

Coverage
description: Spatial topic and spatial applicability may be a named place or a location specified by its geographic coordinates. Temporal topic may be a named period, date, or date range. A jurisdiction may be a named administrative entity or a geographic place to which the resource applies. Recommended best practice is to use a controlled vocabulary such as the Thesaurus of Geographic Names [TGN]. Where appropriate, named places or time periods can be used in preference to numeric identifiers such as sets of coordinates or date ranges.
has version: coverage-006
issued: 1999-07-02
modified: 2008-01-14
type: Property
comment: The spatial or temporal topic of the resource, the spatial applicability of the resource, or the jurisdiction under which the resource is relevant.
note: A second property with the same name as this property has been declared in the dcterms: namespace (http://purl.org/dc/terms/). See the Introduction to the document "DCMI Metadata Terms" (http://dublincore.org/documents/dcmi-terms/) for an explanation.

Rights
description: Typically, rights information includes a statement about various property rights associated with the resource, including intellectual property rights.
has version: rights-006
issued: 1999-07-02
modified: 2008-01-14
type: Property
comment: Information about rights held in and over the resource.
note: A second property with the same name as this property has been declared in the dcterms: namespace (http://purl.org/dc/terms/). See the Introduction to the document "DCMI Metadata Terms" (http://dublincore.org/documents/dcmi-terms/) for an explanation.

Title
has version: title-006
issued: 1999-07-02
modified: 2008-01-14
type: Property
comment: A name given to the resource.
note: A second property with the same name as this property has been declared in the dcterms: namespace (http://purl.org/dc/terms/). See the Introduction to the document "DCMI Metadata Terms" (http://dublincore.org/documents/dcmi-terms/) for an explanation.
type: AnnotationProperty